Target
Nucleotide-binding oligomerization domain-containing protein 2
Ligand
BDBM62386
Substrate
Meas. Tech.
SAR analysis of compounds that inhibit NOD2 revised
IC50
20000±n/a nM
Citation
 PubChem, PC SAR analysis of compounds that inhibit NOD2 revised PubChem Bioassay (2010)[AID] 
Target
Name:
Nucleotide-binding oligomerization domain-containing protein 2
Synonyms:
CARD15 IBD1 NOD2 Nucleotide-binding oligomerization domain-containing protein 2 | nucleotide-binding oligomerization domain containing 2
Type:
PROTEIN
Mol. Mass.:
115287.18
Organism:
Homo sapiens (Human)
Description:
ChEMBL_1454053
Residue:
1040
  
Inhibitor
Name:
BDBM62386
Synonyms:
4-chloranyl-N-[1-[(2-chlorophenyl)methyl]benzimidazol-2-yl]benzamide 4-chloro-N-[1-[(2-chlorophenyl)methyl]-2-benzimidazolyl]benzamide MLS-0435460.0001 | cid_1364840
Type:
Small organic molecule
Emp. Form.:
C21H15Cl2N3O
Mol. Mass.:
396.269
SMILES:
Clc1ccc(cc1)C(=O)Nc1nc2ccccc2n1Cc1ccccc1Cl
: