Target
Nucleotide-binding oligomerization domain-containing protein 2
Ligand
BDBM62380
Substrate
Meas. Tech.
SAR analysis of compounds that inhibit NOD2 revised
IC50
20000±n/a nM
Citation
 PubChem, PC SAR analysis of compounds that inhibit NOD2 revised PubChem Bioassay (2010)[AID] 
Target
Name:
Nucleotide-binding oligomerization domain-containing protein 2
Synonyms:
CARD15 IBD1 NOD2 Nucleotide-binding oligomerization domain-containing protein 2 | nucleotide-binding oligomerization domain containing 2
Type:
PROTEIN
Mol. Mass.:
115287.18
Organism:
Homo sapiens (Human)
Description:
ChEMBL_1454053
Residue:
1040
  
Inhibitor
Name:
BDBM62380
Synonyms:
MLS-0435454.0001 N-[1-[(4-chlorophenyl)methyl]-2-benzimidazolyl]-4-methoxybenzamide N-[1-[(4-chlorophenyl)methyl]benzimidazol-2-yl]-4-methoxybenzamide | cid_44543510
Type:
Small organic molecule
Emp. Form.:
C22H18ClN3O2
Mol. Mass.:
391.85
SMILES:
COc1ccc(cc1)C(=O)Nc1nc2ccccc2n1Cc1ccc(Cl)cc1
: