Target
Tumor necrosis factor
Ligand
BDBM62277
Substrate
Meas. Tech.
SAR analysis of inhibitors of TNFa specific NF-kB induction revised
IC50
414±n/a nM
Citation
 PubChem, PC SAR analysis of inhibitors of TNFa specific NF-kB induction revised PubChem Bioassay (2010)[AID] 
Target
Name:
Tumor necrosis factor
Synonyms:
Cachectin TNF-a TNFA TNFSF2 Tumor necrosis factor (TNFa) Tumor necrosis factor ligand superfamily member 2 Tumor necrosis factor, soluble form | tumor necrosis factor alpha
Type:
Enzyme
Mol. Mass.:
25645.11
Organism:
Homo sapiens (Human)
Description:
P01375
Residue:
233
  
Inhibitor
Name:
BDBM62277
Synonyms:
1-[[(E)-(5-ethoxy-6-keto-cyclohexa-2,4-dien-1-ylidene)methyl]amino]-3-(2-nitrophenyl)thiourea 1-[[(E)-(5-ethoxy-6-oxo-1-cyclohexa-2,4-dienylidene)methyl]amino]-3-(2-nitrophenyl)thiourea MLS-0270696.0001 | cid_6297486
Type:
Small organic molecule
Emp. Form.:
C16H16N4O4S
Mol. Mass.:
360.388
SMILES:
CCOc1ccc[c-](C=[NH+]NC(=S)Nc2ccccc2[N+]([O-])=O)c1=O
: