Target
Tumor necrosis factor
Ligand
BDBM62170
Substrate
Meas. Tech.
SAR analysis of inhibitors of TNFa specific NF-kB induction revised
IC50
>20000±n/a nM
Citation
 PubChem, PC SAR analysis of inhibitors of TNFa specific NF-kB induction revised PubChem Bioassay (2010)[AID] 
Target
Name:
Tumor necrosis factor
Synonyms:
Cachectin TNF-a TNFA TNFSF2 Tumor necrosis factor (TNFa) Tumor necrosis factor ligand superfamily member 2 Tumor necrosis factor, soluble form | tumor necrosis factor alpha
Type:
Enzyme
Mol. Mass.:
25645.11
Organism:
Homo sapiens (Human)
Description:
P01375
Residue:
233
  
Inhibitor
Name:
BDBM62170
Synonyms:
1-(4-chlorophenyl)sulfonyl-2-benzimidazolamine MLS-0425609.0001 [1-(4-chlorophenyl)sulfonylbenzimidazol-2-yl]amine | cid_1088439
Type:
Small organic molecule
Emp. Form.:
C13H10ClN3O2S
Mol. Mass.:
307.755
SMILES:
Nc1nc2ccccc2n1S(=O)(=O)c1ccc(Cl)cc1
: