Target
Sphingosine 1-phosphate receptor 4
Ligand
BDBM62392
Substrate
Meas. Tech.
Late stage fluorescence dose response cell-based screening assay for antagonists of the Sphingosine 1-Phosphate Receptor 4 (S1P4): Synthesized analogues
IC50
513±n/a nM
Citation
 PubChem, PC Late stage fluorescence dose response cell-based screening assay for antagonists of the Sphingosine 1-Phosphate Receptor 4 (S1P4): Synthesized analogues PubChem Bioassay (2010)[AID] 
Target
Name:
Sphingosine 1-phosphate receptor 4
Synonyms:
EDG6 S1P receptor 4 S1P4 S1PR4_HUMAN Sphingosine 1-phosphate receptor Edg-6 sphingosine-1-phosphate 4 S1P4
Type:
G Protein-Coupled Receptor (GPCR)
Mol. Mass.:
41647.39
Organism:
Homo sapiens (Human)
Description:
Residue:
384
  
Inhibitor
Name:
BDBM62392
Synonyms:
5-(2,5-dimethoxyphenyl)-N-(2-ethyl-6-methyl-phenyl)-2-furamide 5-(2,5-dimethoxyphenyl)-N-(2-ethyl-6-methylphenyl)-2-furancarboxamide SR-02000000236 cid_44607572
Type:
Small organic molecule
Emp. Form.:
C22H23NO4
Mol. Mass.:
365.4223
SMILES:
CCc1cccc(C)c1NC(=O)c1ccc(o1)-c1cc(OC)ccc1OC
: