Target
Kappa-type opioid receptor
Ligand
BDBM54833
Substrate
Meas. Tech.
SAR analysis of Antagonists of the Kappa Opioid Receptor (KOR) using an Image-Based Assay
IC50
32000±n/a nM
Citation
 PubChem, PC SAR analysis of Antagonists of the Kappa Opioid Receptor (KOR) using an Image-Based Assay PubChem Bioassay (2010)[AID] 
Target
Name:
Kappa-type opioid receptor
Synonyms:
K-OR-1 Kappa-opioid receptor (KOR) Kappa-type opioid receptor (KOR) OPIATE Kappa OPRK1 kappa opioid receptor (KOR)
Type:
G Protein-Coupled Receptor (GPCR)
Mol. Mass.:
42648.76
Organism:
Homo sapiens (Human)
Description:
P41145
Residue:
380
  
Inhibitor
Name:
BDBM54833
Synonyms:
4-ethoxy-N-[9-(phenylmethyl)-9-azabicyclo[3.3.1]nonan-3-yl]benzamide N-(9-Benzyl-9-aza-bicyclo[3.3.1]non-3-yl)-4-ethoxy-benzamide N-(9-benzyl-9-azabicyclo[3.3.1]nonan-3-yl)-4-ethoxybenzamide cid_3218102
Type:
Small organic molecule
Emp. Form.:
C24H30N2O2
Mol. Mass.:
378.5072
SMILES:
[H]C12CCCC([H])(CC(C1)NC(=O)c1ccc(OCC)cc1)N2Cc1ccccc1
: