Target
Kappa-type opioid receptor
Ligand
BDBM54774
Substrate
Meas. Tech.
SAR analysis of Antagonists of the Kappa Opioid Receptor (KOR) using an Image-Based Assay
IC50
32000±n/a nM
Citation
 PubChem, PC SAR analysis of Antagonists of the Kappa Opioid Receptor (KOR) using an Image-Based Assay PubChem Bioassay (2010)[AID] 
Target
Name:
Kappa-type opioid receptor
Synonyms:
K-OR-1 Kappa-opioid receptor (KOR) Kappa-type opioid receptor (KOR) OPIATE Kappa OPRK1 kappa opioid receptor (KOR)
Type:
G Protein-Coupled Receptor (GPCR)
Mol. Mass.:
42648.76
Organism:
Homo sapiens (Human)
Description:
P41145
Residue:
380
  
Inhibitor
Name:
BDBM54774
Synonyms:
MLS000041397 N-(4-chloro-2-methoxy-5-methyl-phenyl)-2-[[4-(2-furfuryl)-5-(2-pyridyl)-1,2,4-triazol-3-yl]thio]acetamide N-(4-chloro-2-methoxy-5-methylphenyl)-2-[[4-(furan-2-ylmethyl)-5-pyridin-2-yl-1,2,4-triazol-3-yl]sulfanyl]acetamide cid_662887
Type:
Small organic molecule
Emp. Form.:
C22H20ClN5O3S
Mol. Mass.:
469.944
SMILES:
COc1cc(Cl)c(C)cc1NC(=O)CSc1nnc(-c2ccccn2)n1Cc1ccco1
: