Target
Kappa-type opioid receptor
Ligand
BDBM54778
Substrate
Meas. Tech.
SAR analysis of Antagonists of the Kappa Opioid Receptor (KOR) using an Image-Based Assay
IC50
32000±n/a nM
Citation
 PubChem, PC SAR analysis of Antagonists of the Kappa Opioid Receptor (KOR) using an Image-Based Assay PubChem Bioassay (2010)[AID] 
Target
Name:
Kappa-type opioid receptor
Synonyms:
K-OR-1 Kappa-opioid receptor (KOR) Kappa-type opioid receptor (KOR) OPIATE Kappa OPRK1 kappa opioid receptor (KOR)
Type:
G Protein-Coupled Receptor (GPCR)
Mol. Mass.:
42648.76
Organism:
Homo sapiens (Human)
Description:
P41145
Residue:
380
  
Inhibitor
Name:
BDBM54778
Synonyms:
2-[4-(2-furanylmethyl)-5-[[(E)-3-phenylprop-2-enyl]thio]-1,2,4-triazol-3-yl]pyridine 2-[5-[[(E)-cinnamyl]thio]-4-(2-furfuryl)-1,2,4-triazol-3-yl]pyridine MLS000065151 cid_1982054
Type:
Small organic molecule
Emp. Form.:
C21H18N4OS
Mol. Mass.:
374.459
SMILES:
C(Sc1nnc(-c2ccccn2)n1Cc1ccco1)\C=C\c1ccccc1
: