Target
Sphingosine 1-phosphate receptor 3
Ligand
BDBM62393
Substrate
Meas. Tech.
Late stage counterscreen assay for S1P4 antagonists: Fluorescence dose response cell-based screening assay for antagonists of the Sphingosine 1-Phosphate Receptor 3 (S1P3)
IC50
25000±n/a nM
Citation
 PubChem, PC Late stage counterscreen assay for S1P4 antagonists: Fluorescence dose response cell-based screening assay for antagonists of the Sphingosine 1-Phosphate Receptor 3 (S1P3) PubChem Bioassay (2010)[AID] 
Target
Name:
Sphingosine 1-phosphate receptor 3
Synonyms:
C9orf108 EDG3 S1P receptor 3 S1P3 S1PR3_HUMAN Sphingosine 1-phosphate receptor 3 (S1P3) | Sphingosine 1-phosphate receptor Edg-3
Type:
G Protein-Coupled Receptor (GPCR)
Mol. Mass.:
42278.13
Organism:
Homo sapiens (Human)
Description:
Q99500
Residue:
378
  
Inhibitor
Name:
BDBM62393
Synonyms:
5-(2-ethoxy-5-methoxy-phenyl)-N-(2-ethyl-6-methyl-phenyl)-2-furamide 5-(2-ethoxy-5-methoxyphenyl)-N-(2-ethyl-6-methylphenyl)-2-furancarboxamide SR-02000000237 cid_44607578
Type:
Small organic molecule
Emp. Form.:
C23H25NO4
Mol. Mass.:
379.4489
SMILES:
CCOc1ccc(OC)cc1-c1ccc(o1)C(=O)Nc1c(C)cccc1CC
: