Target
Sphingosine 1-phosphate receptor 3
Ligand
BDBM62396
Substrate
Meas. Tech.
Late stage counterscreen assay for S1P4 antagonists: Fluorescence dose response cell-based screening assay for antagonists of the Sphingosine 1-Phosphate Receptor 3 (S1P3)
IC50
25000±n/a nM
Citation
 PubChem, PC Late stage counterscreen assay for S1P4 antagonists: Fluorescence dose response cell-based screening assay for antagonists of the Sphingosine 1-Phosphate Receptor 3 (S1P3) PubChem Bioassay (2010)[AID] 
Target
Name:
Sphingosine 1-phosphate receptor 3
Synonyms:
C9orf108 EDG3 S1P receptor 3 S1P3 S1PR3_HUMAN Sphingosine 1-phosphate receptor 3 (S1P3) | Sphingosine 1-phosphate receptor Edg-3
Type:
G Protein-Coupled Receptor (GPCR)
Mol. Mass.:
42278.13
Organism:
Homo sapiens (Human)
Description:
Q99500
Residue:
378
  
Inhibitor
Name:
BDBM62396
Synonyms:
N-(2,6-dimethylphenyl)-5-(4-methyl-3-thienyl)-2-furamide N-(2,6-dimethylphenyl)-5-(4-methylthiophen-3-yl)furan-2-carboxamide SR-02000000240-1 | cid_44607581
Type:
Small organic molecule
Emp. Form.:
C18H17NO2S
Mol. Mass.:
311.398
SMILES:
Cc1cscc1-c1ccc(o1)C(=O)Nc1c(C)cccc1C
: