Target
Sphingosine 1-phosphate receptor 3
Ligand
BDBM62401
Substrate
Meas. Tech.
Late stage counterscreen assay for S1P4 antagonists: Fluorescence dose response cell-based screening assay for antagonists of the Sphingosine 1-Phosphate Receptor 3 (S1P3)
IC50
9873±n/a nM
Citation
 PubChem, PC Late stage counterscreen assay for S1P4 antagonists: Fluorescence dose response cell-based screening assay for antagonists of the Sphingosine 1-Phosphate Receptor 3 (S1P3) PubChem Bioassay (2010)[AID] 
Target
Name:
Sphingosine 1-phosphate receptor 3
Synonyms:
C9orf108 EDG3 S1P receptor 3 S1P3 S1PR3_HUMAN Sphingosine 1-phosphate receptor 3 (S1P3) | Sphingosine 1-phosphate receptor Edg-3
Type:
G Protein-Coupled Receptor (GPCR)
Mol. Mass.:
42278.13
Organism:
Homo sapiens (Human)
Description:
Q99500
Residue:
378
  
Inhibitor
Name:
BDBM62401
Synonyms:
5-(2,5-dichlorophenyl)-N-(2-methoxy-6-methyl-phenyl)-2-furamide 5-(2,5-dichlorophenyl)-N-(2-methoxy-6-methylphenyl)furan-2-carboxamide SR-02000000245 cid_44607575
Type:
Small organic molecule
Emp. Form.:
C19H15Cl2NO3
Mol. Mass.:
376.233
SMILES:
COc1cccc(C)c1NC(=O)c1ccc(o1)-c1cc(Cl)ccc1Cl
: