Target
Sphingosine 1-phosphate receptor 5
Ligand
BDBM61070
Substrate
Meas. Tech.
Late stage counterscreen assay for S1P4 antagonists: Fluorescence dose response cell-based screening assay for antagonists of the Sphingosine 1-Phosphate Receptor 5 (S1P5)
IC50
34±n/a nM
Citation
 PubChem, PC Late stage counterscreen assay for S1P4 antagonists: Fluorescence dose response cell-based screening assay for antagonists of the Sphingosine 1-Phosphate Receptor 5 (S1P5) PubChem Bioassay (2010)[AID] 
Target
Name:
Sphingosine 1-phosphate receptor 5
Synonyms:
EDG8 S1P5 S1PR5_HUMAN Sphingosine 1-phosphate receptor Edg-8
Type:
G Protein-Coupled Receptor (GPCR)
Mol. Mass.:
41796.42
Organism:
Homo sapiens (Human)
Description:
Residue:
398
  
Inhibitor
Name:
BDBM61070
Synonyms:
(Z)-2-[3-(4-chlorophenyl)-7H-[1,2,4]triazolo[3,4-b][1,3,4]thiadiazin-6-yl]-3-[4-(difluoromethoxy)phenyl]-2-propenoic acid ethyl ester MLS000417101 cid_6217704 ethyl (Z)-3-[4-[bis(fluoranyl)methoxy]phenyl]-2-[3-(4-chlorophenyl)-7H-[1,2,4]triazolo[3,4-b][1,3,4]thiadiazin-6-yl]prop-2-enoate
Type:
Small organic molecule
Emp. Form.:
C22H17ClF2N4O3S
Mol. Mass.:
490.91
SMILES:
CCOC(=O)C(=Cc1ccc(OC(F)F)cc1)C1=Nn2c(SC1)nnc2-c1ccc(Cl)cc1
: