Target
Sphingosine 1-phosphate receptor 5
Ligand
BDBM62402
Substrate
Meas. Tech.
Late stage counterscreen assay for S1P4 antagonists: Fluorescence dose response cell-based screening assay for antagonists of the Sphingosine 1-Phosphate Receptor 5 (S1P5)
IC50
12650±n/a nM
Citation
 PubChem, PC Late stage counterscreen assay for S1P4 antagonists: Fluorescence dose response cell-based screening assay for antagonists of the Sphingosine 1-Phosphate Receptor 5 (S1P5) PubChem Bioassay (2010)[AID] 
Target
Name:
Sphingosine 1-phosphate receptor 5
Synonyms:
EDG8 S1P5 S1PR5_HUMAN Sphingosine 1-phosphate receptor Edg-8
Type:
G Protein-Coupled Receptor (GPCR)
Mol. Mass.:
41796.42
Organism:
Homo sapiens (Human)
Description:
Residue:
398
  
Inhibitor
Name:
BDBM62402
Synonyms:
5-(2,5-dichlorophenyl)-N-(2,6-diisopropylphenyl)-2-furamide 5-(2,5-dichlorophenyl)-N-[2,6-di(propan-2-yl)phenyl]furan-2-carboxamide SR-02000000246 cid_44607577
Type:
Small organic molecule
Emp. Form.:
C23H23Cl2NO2
Mol. Mass.:
416.34
SMILES:
CC(C)c1cccc(C(C)C)c1NC(=O)c1ccc(o1)-c1cc(Cl)ccc1Cl
: