Target
Sphingosine 1-phosphate receptor 1
Ligand
BDBM62399
Substrate
Meas. Tech.
Late stage counterscreen assay for S1P4 antagonists: Fluorescence dose response cell-based screening assay for antagonists of the Sphingosine 1-Phosphate Receptor 1 (S1P1)
IC50
>25000±n/a nM
Citation
 PubChem, PC Late stage counterscreen assay for S1P4 antagonists: Fluorescence dose response cell-based screening assay for antagonists of the Sphingosine 1-Phosphate Receptor 1 (S1P1) PubChem Bioassay (2010)[AID] 
Target
Name:
Sphingosine 1-phosphate receptor 1
Synonyms:
CHEDG1 Endothelial differentiation G-protein coupled receptor 1 S1P1 S1PR1_HUMAN Sphingosine 1-phosphate receptor Edg-1
Type:
Enzyme
Mol. Mass.:
42836.02
Organism:
Homo sapiens (Human)
Description:
P21453
Residue:
382
  
Inhibitor
Name:
BDBM62399
Synonyms:
5-(2,5-dichlorophenyl)-N-(2-methylphenyl)-2-furancarboxamide 5-(2,5-dichlorophenyl)-N-(o-tolyl)-2-furamide SR-02000000243 cid_779010
Type:
Small organic molecule
Emp. Form.:
C18H13Cl2NO2
Mol. Mass.:
346.207
SMILES:
Cc1ccccc1NC(=O)c1ccc(o1)-c1cc(Cl)ccc1Cl
: