Target
Sphingosine 1-phosphate receptor 1
Ligand
BDBM62404
Substrate
Meas. Tech.
Late stage counterscreen assay for S1P4 antagonists: Fluorescence dose response cell-based screening assay for antagonists of the Sphingosine 1-Phosphate Receptor 1 (S1P1)
IC50
>25000±n/a nM
Citation
 PubChem, PC Late stage counterscreen assay for S1P4 antagonists: Fluorescence dose response cell-based screening assay for antagonists of the Sphingosine 1-Phosphate Receptor 1 (S1P1) PubChem Bioassay (2010)[AID] 
Target
Name:
Sphingosine 1-phosphate receptor 1
Synonyms:
CHEDG1 Endothelial differentiation G-protein coupled receptor 1 S1P1 S1PR1_HUMAN Sphingosine 1-phosphate receptor Edg-1
Type:
Enzyme
Mol. Mass.:
42836.02
Organism:
Homo sapiens (Human)
Description:
P21453
Residue:
382
  
Inhibitor
Name:
BDBM62404
Synonyms:
5-(2,5-dichlorophenyl)-N-(2,6-diethylphenyl)-2-furamide 5-(2,5-dichlorophenyl)-N-(2,6-diethylphenyl)furan-2-carboxamide ML131 SR-02000000248-1 | cid_44607580
Type:
Small organic molecule
Emp. Form.:
C21H19Cl2NO2
Mol. Mass.:
388.287
SMILES:
CCc1cccc(CC)c1NC(=O)c1ccc(o1)-c1cc(Cl)ccc1Cl
: