Target
Mu-type opioid receptor
Ligand
BDBM62176
Substrate
Meas. Tech.
SAR Analysis of Agonists of the MOR Receptor using an Image-Based Assay
EC50
>32000±n/a nM
Citation
 PubChem, PC SAR Analysis of Agonists of the MOR Receptor using an Image-Based Assay PubChem Bioassay (2010)[AID] 
Target
Name:
Mu-type opioid receptor
Synonyms:
M-OR-1 MOR-1 MUOR1 Mu opiate receptor OPRM1 hMOP | mu-type opioid receptor isoform MOR-1
Type:
G Protein-Coupled Receptor (GPCR)
Mol. Mass.:
44789.51
Organism:
Homo sapiens (Human)
Description:
P35372
Residue:
400
  
Inhibitor
Name:
BDBM62176
Synonyms:
MLS-0005116.0001 N-butyl-N-[(6-methoxy-2-oxidanylidene-1H-quinolin-3-yl)methyl]pyridine-2-carboxamide N-butyl-N-[(6-methoxy-2-oxo-1H-quinolin-3-yl)methyl]pyridine-2-carboxamide | cid_665064
Type:
Small organic molecule
Emp. Form.:
C21H23N3O3
Mol. Mass.:
365.4256
SMILES:
CCCCN(Cc1cc2cc(OC)ccc2[nH]c1=O)C(=O)c1ccccn1
: