Target
Mu-type opioid receptor
Ligand
BDBM54779
Substrate
Meas. Tech.
SAR Analysis of Agonists of the MOR Receptor using an Image-Based Assay
EC50
>32000±n/a nM
Citation
 PubChem, PC SAR Analysis of Agonists of the MOR Receptor using an Image-Based Assay PubChem Bioassay (2010)[AID] 
Target
Name:
Mu-type opioid receptor
Synonyms:
M-OR-1 MOR-1 MUOR1 Mu opiate receptor OPRM1 hMOP | mu-type opioid receptor isoform MOR-1
Type:
G Protein-Coupled Receptor (GPCR)
Mol. Mass.:
44789.51
Organism:
Homo sapiens (Human)
Description:
P35372
Residue:
400
  
Inhibitor
Name:
BDBM54779
Synonyms:
MLS000048990 N-[1-[(2,6-dimethylanilino)-oxomethyl]cyclopentyl]-N-(2-furanylmethyl)-2-pyridinecarboxamide N-[1-[(2,6-dimethylphenyl)carbamoyl]cyclopentyl]-N-(furan-2-ylmethyl)pyridine-2-carboxamide cid_1297443
Type:
Small organic molecule
Emp. Form.:
C25H27N3O3
Mol. Mass.:
417.5002
SMILES:
Cc1cccc(C)c1NC(=O)C1(CCCC1)N(Cc1ccco1)C(=O)c1ccccn1
: