Target
Mu-type opioid receptor
Ligand
BDBM62200
Substrate
Meas. Tech.
SAR Analysis of Agonists of the MOR Receptor using an Image-Based Assay
EC50
>32000±n/a nM
Citation
 PubChem, PC SAR Analysis of Agonists of the MOR Receptor using an Image-Based Assay PubChem Bioassay (2010)[AID] 
Target
Name:
Mu-type opioid receptor
Synonyms:
M-OR-1 MOR-1 MUOR1 Mu opiate receptor OPRM1 hMOP | mu-type opioid receptor isoform MOR-1
Type:
G Protein-Coupled Receptor (GPCR)
Mol. Mass.:
44789.51
Organism:
Homo sapiens (Human)
Description:
P35372
Residue:
400
  
Inhibitor
Name:
BDBM62200
Synonyms:
4-[[(4-methoxyphenyl)sulfonylamino]methyl]-N-[2-[methyl-(phenylmethyl)amino]ethyl]benzamide N-[2-[benzyl(methyl)amino]ethyl]-4-[[(4-methoxyphenyl)sulfonylamino]methyl]benzamide | cid_20854195
Type:
Small organic molecule
Emp. Form.:
C25H29N3O4S
Mol. Mass.:
467.58
SMILES:
COc1ccc(cc1)S(=O)(=O)NCc1ccc(cc1)C(=O)NCCN(C)Cc1ccccc1
: