Target
Mu-type opioid receptor
Ligand
BDBM54817
Substrate
Meas. Tech.
SAR Analysis of Agonists of the MOR Receptor using an Image-Based Assay
EC50
>32000±n/a nM
Citation
 PubChem, PC SAR Analysis of Agonists of the MOR Receptor using an Image-Based Assay PubChem Bioassay (2010)[AID] 
Target
Name:
Mu-type opioid receptor
Synonyms:
M-OR-1 MOR-1 MUOR1 Mu opiate receptor OPRM1 hMOP | mu-type opioid receptor isoform MOR-1
Type:
G Protein-Coupled Receptor (GPCR)
Mol. Mass.:
44789.51
Organism:
Homo sapiens (Human)
Description:
P35372
Residue:
400
  
Inhibitor
Name:
BDBM54817
Synonyms:
4-[[(4-methylphenyl)sulfonylamino]methyl]-N-[2-[(phenylmethyl)-propan-2-yl-amino]ethyl]benzamide MLS000682490 N-[2-[benzyl(propan-2-yl)amino]ethyl]-4-[[(4-methylphenyl)sulfonylamino]methyl]benzamide SMR000314971 | cid_3342390
Type:
Small organic molecule
Emp. Form.:
C27H33N3O3S
Mol. Mass.:
479.634
SMILES:
CC(C)N(CCNC(=O)c1ccc(CNS(=O)(=O)c2ccc(C)cc2)cc1)Cc1ccccc1
: