Target
Delta-type opioid receptor
Ligand
BDBM62084
Substrate
Meas. Tech.
SAR Analysis of Antagonists of the DOR Receptor using an Image-Based Assay
IC50
32000±n/a nM
Citation
 PubChem, PC SAR Analysis of Antagonists of the DOR Receptor using an Image-Based Assay PubChem Bioassay (2010)[AID] 
Target
Name:
Delta-type opioid receptor
Synonyms:
D-OR-1 Delta opioid receptor OPIATE Delta OPRD1 OPRK1 | opioid receptor, delta 1
Type:
G Protein-Coupled Receptor (GPCR)
Mol. Mass.:
40382.98
Organism:
Homo sapiens (Human)
Description:
Competition binding assays were carried out using membrane preparations from transfected HN9.10 cells that constitutively expressed the delta opioid receptor.
Residue:
372
  
Inhibitor
Name:
BDBM62084
Synonyms:
MLS000519748 N-[1-(cyclopentylcarbamoyl)cyclohexyl]-N-(furan-2-ylmethyl)pyrazine-2-carboxamide SMR000130166 | cid_4579040
Type:
Small organic molecule
Emp. Form.:
C22H28N4O3
Mol. Mass.:
396.4827
SMILES:
O=C(NC1CCCC1)C1(CCCCC1)N(Cc1ccco1)C(=O)c1cnccn1
: