Target
Delta-type opioid receptor
Ligand
BDBM62188
Substrate
Meas. Tech.
SAR Analysis of Agonists of the DOR Receptor using an Image-Based Assay
EC50
>32000±n/a nM
Citation
 PubChem, PC SAR Analysis of Agonists of the DOR Receptor using an Image-Based Assay PubChem Bioassay (2010)[AID] 
Target
Name:
Delta-type opioid receptor
Synonyms:
D-OR-1 Delta opioid receptor OPIATE Delta OPRD1 OPRK1 | opioid receptor, delta 1
Type:
G Protein-Coupled Receptor (GPCR)
Mol. Mass.:
40382.98
Organism:
Homo sapiens (Human)
Description:
Competition binding assays were carried out using membrane preparations from transfected HN9.10 cells that constitutively expressed the delta opioid receptor.
Residue:
372
  
Inhibitor
Name:
BDBM62188
Synonyms:
(phenylmethyl) N-[2,2,2-tris(chloranyl)-1-[(2,5-dimethylphenyl)carbamothioylamino]ethyl]carbamate N-[2,2,2-trichloro-1-[(2,5-dimethylphenyl)thiocarbamoylamino]ethyl]carbamic acid benzyl ester benzyl N-[2,2,2-trichloro-1-[(2,5-dimethylphenyl)carbamothioylamino]ethyl]carbamate | cid_3091260
Type:
Small organic molecule
Emp. Form.:
C19H20Cl3N3O2S
Mol. Mass.:
460.805
SMILES:
Cc1ccc(C)c(NC(=S)NC(NC(=O)OCc2ccccc2)C(Cl)(Cl)Cl)c1
: