Target
Delta-type opioid receptor
Ligand
BDBM57352
Substrate
Meas. Tech.
SAR Analysis of Agonists of the DOR Receptor using an Image-Based Assay
EC50
>32000±n/a nM
Citation
 PubChem, PC SAR Analysis of Agonists of the DOR Receptor using an Image-Based Assay PubChem Bioassay (2010)[AID] 
Target
Name:
Delta-type opioid receptor
Synonyms:
D-OR-1 Delta opioid receptor OPIATE Delta OPRD1 OPRK1 | opioid receptor, delta 1
Type:
G Protein-Coupled Receptor (GPCR)
Mol. Mass.:
40382.98
Organism:
Homo sapiens (Human)
Description:
Competition binding assays were carried out using membrane preparations from transfected HN9.10 cells that constitutively expressed the delta opioid receptor.
Residue:
372
  
Inhibitor
Name:
BDBM57352
Synonyms:
(phenylmethyl) N-[2,2,2-tris(chloranyl)-1-[(3-chlorophenyl)carbamothioylamino]ethyl]carbamate N-[2,2,2-trichloro-1-[(3-chlorophenyl)thiocarbamoylamino]ethyl]carbamic acid benzyl ester SMR000173874 cid_3091264 | {2,2,2-Trichloro-1-[3-(3-chloro-phenyl)-thioureido]-ethyl}-carbamic acid benzyl ester
Type:
Small organic molecule
Emp. Form.:
C17H15Cl4N3O2S
Mol. Mass.:
467.197
SMILES:
Clc1cccc(NC(=S)NC(NC(=O)OCc2ccccc2)C(Cl)(Cl)Cl)c1
: