Target
Delta-type opioid receptor
Ligand
BDBM62181
Substrate
Meas. Tech.
SAR Analysis of Agonists of the DOR Receptor using an Image-Based Assay
EC50
>32000±n/a nM
Citation
 PubChem, PC SAR Analysis of Agonists of the DOR Receptor using an Image-Based Assay PubChem Bioassay (2010)[AID] 
Target
Name:
Delta-type opioid receptor
Synonyms:
D-OR-1 Delta opioid receptor OPIATE Delta OPRD1 OPRK1 | opioid receptor, delta 1
Type:
G Protein-Coupled Receptor (GPCR)
Mol. Mass.:
40382.98
Organism:
Homo sapiens (Human)
Description:
Competition binding assays were carried out using membrane preparations from transfected HN9.10 cells that constitutively expressed the delta opioid receptor.
Residue:
372
  
Inhibitor
Name:
BDBM62181
Synonyms:
2-[[4-(2-furanylmethyl)-5-(2-pyridinyl)-1,2,4-triazol-3-yl]thio]-1-(4-methoxyphenyl)ethanone 2-[[4-(furan-2-ylmethyl)-5-pyridin-2-yl-1,2,4-triazol-3-yl]sulfanyl]-1-(4-methoxyphenyl)ethanone cid_662262
Type:
Small organic molecule
Emp. Form.:
C21H18N4O3S
Mol. Mass.:
406.458
SMILES:
COc1ccc(cc1)C(=O)CSc1nnc(-c2ccccn2)n1Cc1ccco1
: