Target
Delta-type opioid receptor
Ligand
BDBM54779
Substrate
Meas. Tech.
SAR Analysis of Agonists of the DOR Receptor using an Image-Based Assay
EC50
>32000±n/a nM
Citation
 PubChem, PC SAR Analysis of Agonists of the DOR Receptor using an Image-Based Assay PubChem Bioassay (2010)[AID] 
Target
Name:
Delta-type opioid receptor
Synonyms:
D-OR-1 Delta opioid receptor OPIATE Delta OPRD1 OPRK1 | opioid receptor, delta 1
Type:
G Protein-Coupled Receptor (GPCR)
Mol. Mass.:
40382.98
Organism:
Homo sapiens (Human)
Description:
Competition binding assays were carried out using membrane preparations from transfected HN9.10 cells that constitutively expressed the delta opioid receptor.
Residue:
372
  
Inhibitor
Name:
BDBM54779
Synonyms:
MLS000048990 N-[1-[(2,6-dimethylanilino)-oxomethyl]cyclopentyl]-N-(2-furanylmethyl)-2-pyridinecarboxamide N-[1-[(2,6-dimethylphenyl)carbamoyl]cyclopentyl]-N-(furan-2-ylmethyl)pyridine-2-carboxamide cid_1297443
Type:
Small organic molecule
Emp. Form.:
C25H27N3O3
Mol. Mass.:
417.5002
SMILES:
Cc1cccc(C)c1NC(=O)C1(CCCC1)N(Cc1ccco1)C(=O)c1ccccn1
: