Target
Delta-type opioid receptor
Ligand
BDBM54777
Substrate
Meas. Tech.
SAR Analysis of Agonists of the DOR Receptor using an Image-Based Assay
EC50
>32000±n/a nM
Citation
 PubChem, PC SAR Analysis of Agonists of the DOR Receptor using an Image-Based Assay PubChem Bioassay (2010)[AID] 
Target
Name:
Delta-type opioid receptor
Synonyms:
D-OR-1 Delta opioid receptor OPIATE Delta OPRD1 OPRK1 | opioid receptor, delta 1
Type:
G Protein-Coupled Receptor (GPCR)
Mol. Mass.:
40382.98
Organism:
Homo sapiens (Human)
Description:
Competition binding assays were carried out using membrane preparations from transfected HN9.10 cells that constitutively expressed the delta opioid receptor.
Residue:
372
  
Inhibitor
Name:
BDBM54777
Synonyms:
MLS000095008 N-[1-(cyclohexylamino)-2-methyl-1-oxobutan-2-yl]-N-(2-furanylmethyl)-2-pyrazinecarboxamide N-[1-(cyclohexylcarbamoyl)-1-methyl-propyl]-N-(2-furfuryl)pyrazinamide cid_3242935
Type:
Small organic molecule
Emp. Form.:
C21H28N4O3
Mol. Mass.:
384.472
SMILES:
CCC(C)(N(Cc1ccco1)C(=O)c1cnccn1)C(=O)NC1CCCCC1
: