Target
Trans-activator protein BZLF1
Ligand
BDBM62414
Substrate
Meas. Tech.
Counterscreen for inhibitors of EBNA-1: fluorescence polarization-based biochemical high throughput dose response assay to identify inhibitors of the Epstein-Barr virus-encoded protein, ZTA
IC50
111248±n/a nM
Citation
 PubChem, PC Counterscreen for inhibitors of EBNA-1: fluorescence polarization-based biochemical high throughput dose response assay to identify inhibitors of the Epstein-Barr virus-encoded protein, ZTA PubChem Bioassay (2010)[AID] 
Target
Name:
Trans-activator protein BZLF1
Synonyms:
BZLF1 PPP5C protein
Type:
Enzyme Catalytic Domain
Mol. Mass.:
26856.37
Organism:
Human herpesvirus 4
Description:
gi_82503229
Residue:
245
  
Inhibitor
Name:
BDBM62414
Synonyms:
1-[2,5-dimethyl-1-(2-oxolanylmethyl)-3-pyrrolyl]-2-[(1-phenyl-5-tetrazolyl)thio]ethanone 1-[2,5-dimethyl-1-(oxolan-2-ylmethyl)pyrrol-3-yl]-2-[(1-phenyl-1,2,3,4-tetrazol-5-yl)sulfanyl]ethanone MLS000057317 cid_2998640
Type:
Small organic molecule
Emp. Form.:
C20H23N5O2S
Mol. Mass.:
397.494
SMILES:
Cc1cc(C(=O)CSc2nnnn2-c2ccccc2)c(C)n1CC1CCCO1
: