Target
Trans-activator protein BZLF1
Ligand
BDBM62450
Substrate
Meas. Tech.
Counterscreen for inhibitors of EBNA-1: fluorescence polarization-based biochemical high throughput dose response assay to identify inhibitors of the Epstein-Barr virus-encoded protein, ZTA
IC50
111248±n/a nM
Citation
 PubChem, PC Counterscreen for inhibitors of EBNA-1: fluorescence polarization-based biochemical high throughput dose response assay to identify inhibitors of the Epstein-Barr virus-encoded protein, ZTA PubChem Bioassay (2010)[AID] 
Target
Name:
Trans-activator protein BZLF1
Synonyms:
BZLF1 PPP5C protein
Type:
Enzyme Catalytic Domain
Mol. Mass.:
26856.37
Organism:
Human herpesvirus 4
Description:
gi_82503229
Residue:
245
  
Inhibitor
Name:
BDBM62450
Synonyms:
MLS000583946 N-[(2-methoxyphenyl)methyl]-6H-indolo[2,3-b]quinoxaline-2-carboxamide SMR000206932 | cid_6079611
Type:
Small organic molecule
Emp. Form.:
C23H18N4O2
Mol. Mass.:
382.4146
SMILES:
COc1ccccc1CNC(=O)c1ccc2nc3[nH]c4ccccc4c3nc2c1
: