Target
Trans-activator protein BZLF1
Ligand
BDBM62473
Substrate
Meas. Tech.
Counterscreen for inhibitors of EBNA-1: fluorescence polarization-based biochemical high throughput dose response assay to identify inhibitors of the Epstein-Barr virus-encoded protein, ZTA
IC50
111248±n/a nM
Citation
 PubChem, PC Counterscreen for inhibitors of EBNA-1: fluorescence polarization-based biochemical high throughput dose response assay to identify inhibitors of the Epstein-Barr virus-encoded protein, ZTA PubChem Bioassay (2010)[AID] 
Target
Name:
Trans-activator protein BZLF1
Synonyms:
BZLF1 PPP5C protein
Type:
Enzyme Catalytic Domain
Mol. Mass.:
26856.37
Organism:
Human herpesvirus 4
Description:
gi_82503229
Residue:
245
  
Inhibitor
Name:
BDBM62473
Synonyms:
4-bromanyl-N-[1-[4-[(4-fluorophenyl)carbonylamino]phenyl]ethylideneamino]-2-methyl-pyrazole-3-carboxamide 4-bromo-N-[1-[4-[(4-fluorobenzoyl)amino]phenyl]ethylideneamino]-2-methylpyrazole-3-carboxamide MLS000703829 SMR000227378 | cid_1002917
Type:
Small organic molecule
Emp. Form.:
C20H17BrFN5O2
Mol. Mass.:
458.284
SMILES:
CC(=NNC(=O)c1c(Br)cnn1C)c1ccc(NC(=O)c2ccc(F)cc2)cc1
: