Target
Trans-activator protein BZLF1
Ligand
BDBM62504
Substrate
Meas. Tech.
Counterscreen for inhibitors of EBNA-1: fluorescence polarization-based biochemical high throughput dose response assay to identify inhibitors of the Epstein-Barr virus-encoded protein, ZTA
IC50
111248±n/a nM
Citation
 PubChem, PC Counterscreen for inhibitors of EBNA-1: fluorescence polarization-based biochemical high throughput dose response assay to identify inhibitors of the Epstein-Barr virus-encoded protein, ZTA PubChem Bioassay (2010)[AID] 
Target
Name:
Trans-activator protein BZLF1
Synonyms:
BZLF1 PPP5C protein
Type:
Enzyme Catalytic Domain
Mol. Mass.:
26856.37
Organism:
Human herpesvirus 4
Description:
gi_82503229
Residue:
245
  
Inhibitor
Name:
BDBM62504
Synonyms:
MLS001035624 N-[4-[[(4-fluorophenyl)carbonylamino]carbamoyl]phenyl]benzamide SMR000666384 | cid_2207359
Type:
Small organic molecule
Emp. Form.:
C21H16FN3O3
Mol. Mass.:
377.3684
SMILES:
Fc1ccc(cc1)C(=O)NNC(=O)c1ccc(NC(=O)c2ccccc2)cc1
: