Target
Epstein-Barr nuclear antigen 1
Ligand
BDBM62412
Substrate
Meas. Tech.
Fluorescence polarization-based biochemical high throughput dose response assay for inhibitors of the Epstein-Barr virus nuclear antigen 1 (EBNA-1)
IC50
13095±n/a nM
Citation
 PubChem, PC Fluorescence polarization-based biochemical high throughput dose response assay for inhibitors of the Epstein-Barr virus nuclear antigen 1 (EBNA-1) PubChem Bioassay (2010)[AID] 
Target
Name:
Epstein-Barr nuclear antigen 1
Synonyms:
EBNA-1 protein EBNA1_EBVB9 | Epstein-Barr virus protease (EBV Pr)
Type:
Enzyme Catalytic Domain
Mol. Mass.:
56444.81
Organism:
Human herpesvirus 4
Description:
gi_23893623
Residue:
641
  
Inhibitor
Name:
BDBM62412
Synonyms:
2-[2-(4-bromophenyl)-2-keto-ethyl]-1-keto-8,9-dihydro-7H-pyrimido[5,4-a]pyrrolizine-5-carbonitrile 2-[2-(4-bromophenyl)-2-oxoethyl]-1-oxo-8,9-dihydro-7H-pyrimido[5,4-a]pyrrolizine-5-carbonitrile SMR000038026 | cid_659700
Type:
Small organic molecule
Emp. Form.:
C18H13BrN4O2
Mol. Mass.:
397.225
SMILES:
Brc1ccc(cc1)C(=O)Cn1cnc2c(C#N)n3CCCc3c2c1=O
: