Target
Epstein-Barr nuclear antigen 1
Ligand
BDBM62413
Substrate
Meas. Tech.
Fluorescence polarization-based biochemical high throughput dose response assay for inhibitors of the Epstein-Barr virus nuclear antigen 1 (EBNA-1)
IC50
11169±n/a nM
Citation
 PubChem, PC Fluorescence polarization-based biochemical high throughput dose response assay for inhibitors of the Epstein-Barr virus nuclear antigen 1 (EBNA-1) PubChem Bioassay (2010)[AID] 
Target
Name:
Epstein-Barr nuclear antigen 1
Synonyms:
EBNA-1 protein EBNA1_EBVB9 | Epstein-Barr virus protease (EBV Pr)
Type:
Enzyme Catalytic Domain
Mol. Mass.:
56444.81
Organism:
Human herpesvirus 4
Description:
gi_23893623
Residue:
641
  
Inhibitor
Name:
BDBM62413
Synonyms:
5-amino-4-(1,3-benzothiazol-2-yl)-1-(4-methoxyphenyl)-2-pyrrolin-3-one 5-azanyl-4-(1,3-benzothiazol-2-yl)-1-(4-methoxyphenyl)-2H-pyrrol-3-one SMR000060394 | cid_725152
Type:
Small organic molecule
Emp. Form.:
C18H15N3O2S
Mol. Mass.:
337.396
SMILES:
COc1ccc(cc1)-n1cc(O)c(c1N)-c1nc2ccccc2s1
: