Target
Epstein-Barr nuclear antigen 1
Ligand
BDBM62414
Substrate
Meas. Tech.
Fluorescence polarization-based biochemical high throughput dose response assay for inhibitors of the Epstein-Barr virus nuclear antigen 1 (EBNA-1)
IC50
5233±n/a nM
Citation
 PubChem, PC Fluorescence polarization-based biochemical high throughput dose response assay for inhibitors of the Epstein-Barr virus nuclear antigen 1 (EBNA-1) PubChem Bioassay (2010)[AID] 
Target
Name:
Epstein-Barr nuclear antigen 1
Synonyms:
EBNA-1 protein EBNA1_EBVB9 | Epstein-Barr virus protease (EBV Pr)
Type:
Enzyme Catalytic Domain
Mol. Mass.:
56444.81
Organism:
Human herpesvirus 4
Description:
gi_23893623
Residue:
641
  
Inhibitor
Name:
BDBM62414
Synonyms:
1-[2,5-dimethyl-1-(2-oxolanylmethyl)-3-pyrrolyl]-2-[(1-phenyl-5-tetrazolyl)thio]ethanone 1-[2,5-dimethyl-1-(oxolan-2-ylmethyl)pyrrol-3-yl]-2-[(1-phenyl-1,2,3,4-tetrazol-5-yl)sulfanyl]ethanone MLS000057317 cid_2998640
Type:
Small organic molecule
Emp. Form.:
C20H23N5O2S
Mol. Mass.:
397.494
SMILES:
Cc1cc(C(=O)CSc2nnnn2-c2ccccc2)c(C)n1CC1CCCO1
: