Target
Epstein-Barr nuclear antigen 1
Ligand
BDBM62440
Substrate
Meas. Tech.
Fluorescence polarization-based biochemical high throughput dose response assay for inhibitors of the Epstein-Barr virus nuclear antigen 1 (EBNA-1)
IC50
19991±n/a nM
Citation
 PubChem, PC Fluorescence polarization-based biochemical high throughput dose response assay for inhibitors of the Epstein-Barr virus nuclear antigen 1 (EBNA-1) PubChem Bioassay (2010)[AID] 
Target
Name:
Epstein-Barr nuclear antigen 1
Synonyms:
EBNA-1 protein EBNA1_EBVB9 | Epstein-Barr virus protease (EBV Pr)
Type:
Enzyme Catalytic Domain
Mol. Mass.:
56444.81
Organism:
Human herpesvirus 4
Description:
gi_23893623
Residue:
641
  
Inhibitor
Name:
BDBM62440
Synonyms:
MLS000578646 N-[(E)-1-(1H-benzimidazol-2-yl)-2-(4-bromophenyl)ethenyl]furan-2-carboxamide N-[1-(1H-benzimidazol-2-yl)-2-(4-bromophenyl)vinyl]-2-furamide cid_5340350
Type:
Small organic molecule
Emp. Form.:
C20H14BrN3O2
Mol. Mass.:
408.248
SMILES:
Brc1ccc(\C=C(\NC(=O)c2ccco2)c2nc3ccccc3[nH]2)cc1
: