Target
Epstein-Barr nuclear antigen 1
Ligand
BDBM62443
Substrate
Meas. Tech.
Fluorescence polarization-based biochemical high throughput dose response assay for inhibitors of the Epstein-Barr virus nuclear antigen 1 (EBNA-1)
IC50
12952±n/a nM
Citation
 PubChem, PC Fluorescence polarization-based biochemical high throughput dose response assay for inhibitors of the Epstein-Barr virus nuclear antigen 1 (EBNA-1) PubChem Bioassay (2010)[AID] 
Target
Name:
Epstein-Barr nuclear antigen 1
Synonyms:
EBNA-1 protein EBNA1_EBVB9 | Epstein-Barr virus protease (EBV Pr)
Type:
Enzyme Catalytic Domain
Mol. Mass.:
56444.81
Organism:
Human herpesvirus 4
Description:
gi_23893623
Residue:
641
  
Inhibitor
Name:
BDBM62443
Synonyms:
MLS000581631 N-[5-(1H-benzimidazol-2-yl)-2-methyl-phenyl]-3,6-dichloro-benzothiophene-2-carboxamide SMR000200264 | cid_2214803
Type:
Small organic molecule
Emp. Form.:
C23H15Cl2N3OS
Mol. Mass.:
452.356
SMILES:
Cc1ccc(cc1NC(=O)c1sc2cc(Cl)ccc2c1Cl)-c1nc2ccccc2[nH]1
: