Target
Epstein-Barr nuclear antigen 1
Ligand
BDBM62452
Substrate
Meas. Tech.
Fluorescence polarization-based biochemical high throughput dose response assay for inhibitors of the Epstein-Barr virus nuclear antigen 1 (EBNA-1)
IC50
6094±n/a nM
Citation
 PubChem, PC Fluorescence polarization-based biochemical high throughput dose response assay for inhibitors of the Epstein-Barr virus nuclear antigen 1 (EBNA-1) PubChem Bioassay (2010)[AID] 
Target
Name:
Epstein-Barr nuclear antigen 1
Synonyms:
EBNA-1 protein EBNA1_EBVB9 | Epstein-Barr virus protease (EBV Pr)
Type:
Enzyme Catalytic Domain
Mol. Mass.:
56444.81
Organism:
Human herpesvirus 4
Description:
gi_23893623
Residue:
641
  
Inhibitor
Name:
BDBM62452
Synonyms:
4-N-(3,4-dimethylphenyl)-5-nitro-2-N-(oxolan-2-ylmethyl)pyrimidine-2,4,6-triamine N'-(3,4-Dimethyl-phenyl)-5-nitro-N-(tetrahydro-furan-2-ylmethyl)-pyrimidine-2,4,6-triamine N4-(3,4-dimethylphenyl)-5-nitro-N2-(oxolan-2-ylmethyl)pyrimidine-2,4,6-triamine [4-amino-6-(3,4-dimethylanilino)-5-nitro-pyrimidin-2-yl]-(tetrahydrofurfuryl)amine | cid_3798147
Type:
Small organic molecule
Emp. Form.:
C17H22N6O3
Mol. Mass.:
358.395
SMILES:
Cc1ccc(Nc2nc(NCC3CCCO3)nc(N)c2[N+]([O-])=O)cc1C
: