Target
Epstein-Barr nuclear antigen 1
Ligand
BDBM62453
Substrate
Meas. Tech.
Fluorescence polarization-based biochemical high throughput dose response assay for inhibitors of the Epstein-Barr virus nuclear antigen 1 (EBNA-1)
IC50
14765±n/a nM
Citation
 PubChem, PC Fluorescence polarization-based biochemical high throughput dose response assay for inhibitors of the Epstein-Barr virus nuclear antigen 1 (EBNA-1) PubChem Bioassay (2010)[AID] 
Target
Name:
Epstein-Barr nuclear antigen 1
Synonyms:
EBNA-1 protein EBNA1_EBVB9 | Epstein-Barr virus protease (EBV Pr)
Type:
Enzyme Catalytic Domain
Mol. Mass.:
56444.81
Organism:
Human herpesvirus 4
Description:
gi_23893623
Residue:
641
  
Inhibitor
Name:
BDBM62453
Synonyms:
MLS000697293 N-[[4-(azepan-1-ylsulfonyl)phenyl]carbamothioyl]thiophene-2-carboxamide SMR000238005 | cid_1416738
Type:
Small organic molecule
Emp. Form.:
C18H21N3O3S3
Mol. Mass.:
423.573
SMILES:
O=C(NC(=S)Nc1ccc(cc1)S(=O)(=O)N1CCCCCC1)c1cccs1
: