Target
Epstein-Barr nuclear antigen 1
Ligand
BDBM62482
Substrate
Meas. Tech.
Fluorescence polarization-based biochemical high throughput dose response assay for inhibitors of the Epstein-Barr virus nuclear antigen 1 (EBNA-1)
IC50
5942±n/a nM
Citation
 PubChem, PC Fluorescence polarization-based biochemical high throughput dose response assay for inhibitors of the Epstein-Barr virus nuclear antigen 1 (EBNA-1) PubChem Bioassay (2010)[AID] 
Target
Name:
Epstein-Barr nuclear antigen 1
Synonyms:
EBNA-1 protein EBNA1_EBVB9 | Epstein-Barr virus protease (EBV Pr)
Type:
Enzyme Catalytic Domain
Mol. Mass.:
56444.81
Organism:
Human herpesvirus 4
Description:
gi_23893623
Residue:
641
  
Inhibitor
Name:
BDBM62482
Synonyms:
4-(3-fluorophenyl)sulfonyl-N-[(4-methoxyphenyl)methyl]-1-piperazinecarbothioamide 4-(3-fluorophenyl)sulfonyl-N-p-anisyl-piperazine-1-carbothioamide SMR000364621 | cid_2569452
Type:
Small organic molecule
Emp. Form.:
C19H22FN3O3S2
Mol. Mass.:
423.525
SMILES:
COc1ccc(CNC(=S)N2CCN(CC2)S(=O)(=O)c2cccc(F)c2)cc1
: