Target
Epstein-Barr nuclear antigen 1
Ligand
BDBM62495
Substrate
Meas. Tech.
Fluorescence polarization-based biochemical high throughput dose response assay for inhibitors of the Epstein-Barr virus nuclear antigen 1 (EBNA-1)
IC50
15400±n/a nM
Citation
 PubChem, PC Fluorescence polarization-based biochemical high throughput dose response assay for inhibitors of the Epstein-Barr virus nuclear antigen 1 (EBNA-1) PubChem Bioassay (2010)[AID] 
Target
Name:
Epstein-Barr nuclear antigen 1
Synonyms:
EBNA-1 protein EBNA1_EBVB9 | Epstein-Barr virus protease (EBV Pr)
Type:
Enzyme Catalytic Domain
Mol. Mass.:
56444.81
Organism:
Human herpesvirus 4
Description:
gi_23893623
Residue:
641
  
Inhibitor
Name:
BDBM62495
Synonyms:
MLS001204304 N-(4-benzamido-2,5-dimethoxy-phenyl)-4-bromanyl-benzamide N-(4-benzamido-2,5-dimethoxyphenyl)-4-bromobenzamide cid_1077887
Type:
Small organic molecule
Emp. Form.:
C22H19BrN2O4
Mol. Mass.:
455.301
SMILES:
COc1cc(NC(=O)c2ccc(Br)cc2)c(OC)cc1NC(=O)c1ccccc1
: