Target
Epstein-Barr nuclear antigen 1
Ligand
BDBM62506
Substrate
Meas. Tech.
Fluorescence polarization-based biochemical high throughput dose response assay for inhibitors of the Epstein-Barr virus nuclear antigen 1 (EBNA-1)
IC50
5522±n/a nM
Citation
 PubChem, PC Fluorescence polarization-based biochemical high throughput dose response assay for inhibitors of the Epstein-Barr virus nuclear antigen 1 (EBNA-1) PubChem Bioassay (2010)[AID] 
Target
Name:
Epstein-Barr nuclear antigen 1
Synonyms:
EBNA-1 protein EBNA1_EBVB9 | Epstein-Barr virus protease (EBV Pr)
Type:
Enzyme Catalytic Domain
Mol. Mass.:
56444.81
Organism:
Human herpesvirus 4
Description:
gi_23893623
Residue:
641
  
Inhibitor
Name:
BDBM62506
Synonyms:
4-[2-[2-(2-bromanyl-4-methyl-phenoxy)ethanoyl]hydrazinyl]-N-(4-ethoxyphenyl)-4-oxidanylidene-butanamide 4-[N'-[2-(2-bromo-4-methyl-phenoxy)acetyl]hydrazino]-4-keto-N-p-phenetyl-butyramide 4-{2-[(2-bromo-4-methylphenoxy)acetyl]hydrazino}-N-(4-ethoxyphenyl)-4-oxobutanamide SMR000672963 | cid_5165670
Type:
Small organic molecule
Emp. Form.:
C21H24BrN3O5
Mol. Mass.:
478.336
SMILES:
CCOc1ccc(NC(=O)CCC(=O)NNC(=O)COc2ccc(C)cc2Br)cc1
: