Target
Epstein-Barr nuclear antigen 1
Ligand
BDBM62517
Substrate
Meas. Tech.
Fluorescence polarization-based biochemical high throughput dose response assay for inhibitors of the Epstein-Barr virus nuclear antigen 1 (EBNA-1)
IC50
4708±n/a nM
Citation
 PubChem, PC Fluorescence polarization-based biochemical high throughput dose response assay for inhibitors of the Epstein-Barr virus nuclear antigen 1 (EBNA-1) PubChem Bioassay (2010)[AID] 
Target
Name:
Epstein-Barr nuclear antigen 1
Synonyms:
EBNA-1 protein EBNA1_EBVB9 | Epstein-Barr virus protease (EBV Pr)
Type:
Enzyme Catalytic Domain
Mol. Mass.:
56444.81
Organism:
Human herpesvirus 4
Description:
gi_23893623
Residue:
641
  
Inhibitor
Name:
BDBM62517
Synonyms:
5-methoxy-3-methyl-2-benzofurancarboxylic acid [2-(4-acetamidoanilino)-2-oxoethyl] ester MLS001129294 [2-(4-acetamidoanilino)-2-oxoethyl] 5-methoxy-3-methyl-1-benzofuran-2-carboxylate cid_7270392
Type:
Small organic molecule
Emp. Form.:
C21H20N2O6
Mol. Mass.:
396.3933
SMILES:
COc1ccc2oc(C(=O)OCC(=O)Nc3ccc(NC(C)=O)cc3)c(C)c2c1
: