Target
Epstein-Barr nuclear antigen 1
Ligand
BDBM62521
Substrate
Meas. Tech.
Fluorescence polarization-based biochemical high throughput dose response assay for inhibitors of the Epstein-Barr virus nuclear antigen 1 (EBNA-1)
IC50
147783±n/a nM
Citation
 PubChem, PC Fluorescence polarization-based biochemical high throughput dose response assay for inhibitors of the Epstein-Barr virus nuclear antigen 1 (EBNA-1) PubChem Bioassay (2010)[AID] 
Target
Name:
Epstein-Barr nuclear antigen 1
Synonyms:
EBNA-1 protein EBNA1_EBVB9 | Epstein-Barr virus protease (EBV Pr)
Type:
Enzyme Catalytic Domain
Mol. Mass.:
56444.81
Organism:
Human herpesvirus 4
Description:
gi_23893623
Residue:
641
  
Inhibitor
Name:
BDBM62521
Synonyms:
MLS002174159 cid_25102455
Type:
Small organic molecule
Emp. Form.:
C23H20Cl2N2O5
Mol. Mass.:
475.321
SMILES:
[H][C@]12COc3ccc(Cl)cc3[C@]1([H])N1C(=O)c3ccc(Cl)cc3NC(=O)[C@@]1(C)[C@H]2C(=O)OCC
: