Target
Heat shock factor protein 1
Ligand
BDBM62736
Substrate
Meas. Tech.
Luminescence Cell-Based Dose Confimation HTS to Identify Inhibitors of Heat Shock Factor 1 (HSF1)
EC50
1523±1151 nM
Citation
 PubChem, PC Luminescence Cell-Based Dose Confimation HTS to Identify Inhibitors of Heat Shock Factor 1 (HSF1) PubChem Bioassay (2010)[AID] 
Target
Name:
Heat shock factor protein 1
Synonyms:
HSF1_MOUSE Hsf1 protein
Type:
Enzyme Catalytic Domain
Mol. Mass.:
57208.68
Organism:
Mus musculus
Description:
P38532
Residue:
525
  
Inhibitor
Name:
BDBM62736
Synonyms:
1-(4-methoxyphenyl)-N-(3-morpholin-4-ylpropyl)pyrazolo[3,4-d]pyrimidin-4-amine 1-(4-methoxyphenyl)-N-[3-(4-morpholinyl)propyl]-4-pyrazolo[3,4-d]pyrimidinamine SMR000073117 cid_1830536
Type:
Small organic molecule
Emp. Form.:
C19H24N6O2
Mol. Mass.:
368.4329
SMILES:
COc1ccc(cc1)-n1ncc2c(NCCCN3CCOCC3)ncnc12
: