Target
Heat shock factor protein 1
Ligand
BDBM62865
Substrate
Meas. Tech.
Luminescence Cell-Based Dose Confimation HTS to Identify Inhibitors of Heat Shock Factor 1 (HSF1)
EC50
>195000±0 nM
Citation
 PubChem, PC Luminescence Cell-Based Dose Confimation HTS to Identify Inhibitors of Heat Shock Factor 1 (HSF1) PubChem Bioassay (2010)[AID] 
Target
Name:
Heat shock factor protein 1
Synonyms:
HSF1_MOUSE Hsf1 protein
Type:
Enzyme Catalytic Domain
Mol. Mass.:
57208.68
Organism:
Mus musculus
Description:
P38532
Residue:
525
  
Inhibitor
Name:
BDBM62865
Synonyms:
4-(2,5-dimethoxybenzoyl)benzoic acid 4-[(2,5-dimethoxyphenyl)-oxomethyl]benzoic acid SMR000102590 | cid_793494
Type:
Small organic molecule
Emp. Form.:
C16H14O5
Mol. Mass.:
286.2794
SMILES:
COc1ccc(OC)c(c1)C(=O)c1ccc(cc1)C(O)=O
: