Target
Heat shock factor protein 1
Ligand
BDBM55675
Substrate
Meas. Tech.
Luminescence Cell-Based Dose Confimation HTS to Identify Inhibitors of Heat Shock Factor 1 (HSF1)
EC50
5287±1190 nM
Citation
 PubChem, PC Luminescence Cell-Based Dose Confimation HTS to Identify Inhibitors of Heat Shock Factor 1 (HSF1) PubChem Bioassay (2010)[AID] 
Target
Name:
Heat shock factor protein 1
Synonyms:
HSF1_MOUSE Hsf1 protein
Type:
Enzyme Catalytic Domain
Mol. Mass.:
57208.68
Organism:
Mus musculus
Description:
P38532
Residue:
525
  
Inhibitor
Name:
BDBM55675
Synonyms:
(E)-N-[2-(cyclohexylamino)-2-keto-ethyl]-N-(4-fluorobenzyl)-4-(2-hydroxy-4-methoxy-phenyl)-4-keto-but-2-enamide (E)-N-[2-(cyclohexylamino)-2-oxoethyl]-N-[(4-fluorophenyl)methyl]-4-(2-hydroxy-4-methoxyphenyl)-4-oxo-2-butenamide MLS000714568 cid_5770961
Type:
Small organic molecule
Emp. Form.:
C26H29FN2O5
Mol. Mass.:
468.5173
SMILES:
COc1ccc(C(=O)\C=C\C(=O)N(CC(=O)NC2CCCCC2)Cc2ccc(F)cc2)c(O)c1
: