Target
Heat shock factor protein 1
Ligand
BDBM63397
Substrate
Meas. Tech.
Luminescence Cell-Based Dose Confimation HTS to Identify Inhibitors of Heat Shock Factor 1 (HSF1)
EC50
3637±1078 nM
Citation
 PubChem, PC Luminescence Cell-Based Dose Confimation HTS to Identify Inhibitors of Heat Shock Factor 1 (HSF1) PubChem Bioassay (2010)[AID] 
Target
Name:
Heat shock factor protein 1
Synonyms:
HSF1_MOUSE Hsf1 protein
Type:
Enzyme Catalytic Domain
Mol. Mass.:
57208.68
Organism:
Mus musculus
Description:
P38532
Residue:
525
  
Inhibitor
Name:
BDBM63397
Synonyms:
MLS000723546 cid_5833488 | ethyl (2Z)-2-(9H-indeno[1,2-b][1,2,5]oxadiazolo[3,4-e]pyrazin-9-ylidene)hydrazinecarboxylate
Type:
Small organic molecule
Emp. Form.:
C14H10N6O3
Mol. Mass.:
310.2676
SMILES:
CCOC(=O)N\N=C1\c2ccccc2-c2nc3nonc3nc12
: