Target
Heat shock factor protein 1
Ligand
BDBM48026
Substrate
Meas. Tech.
Luminescence Cell-Based Dose Confimation HTS to Identify Inhibitors of Heat Shock Factor 1 (HSF1)
EC50
1162±1099 nM
Citation
 PubChem, PC Luminescence Cell-Based Dose Confimation HTS to Identify Inhibitors of Heat Shock Factor 1 (HSF1) PubChem Bioassay (2010)[AID] 
Target
Name:
Heat shock factor protein 1
Synonyms:
HSF1_MOUSE Hsf1 protein
Type:
Enzyme Catalytic Domain
Mol. Mass.:
57208.68
Organism:
Mus musculus
Description:
P38532
Residue:
525
  
Inhibitor
Name:
BDBM48026
Synonyms:
(NE)-4-ethyl-N-[3-(4-hydroxyanilino)-4-keto-1-naphthylidene]benzenesulfonamide (NE)-4-ethyl-N-[3-(4-hydroxyanilino)-4-oxonaphthalen-1-ylidene]benzenesulfonamide MLS000948011 cid_22524940
Type:
Small organic molecule
Emp. Form.:
C24H20N2O4S
Mol. Mass.:
432.492
SMILES:
CCc1ccc(cc1)S(=O)(=O)N=C1C=C(Nc2ccc(O)cc2)C(=O)c2ccccc12
: