Target
ATP-dependent molecular chaperone HSP82
Ligand
BDBM64542
Substrate
Meas. Tech.
Fluorescence Cell-Based Secondary Assay to Measure Toxicity of Compounds Not in the Presence of Fluconazole
EC50
>160000±0 nM
Citation
 PubChem, PC Fluorescence Cell-Based Secondary Assay to Measure Toxicity of Compounds Not in the Presence of Fluconazole PubChem Bioassay (2010)[AID] 
Target
Name:
ATP-dependent molecular chaperone HSP82
Synonyms:
heat shock protein 90
Type:
Enzyme Catalytic Domain
Mol. Mass.:
80784.12
Organism:
Candida albicans
Description:
gi_994798
Residue:
707
  
Inhibitor
Name:
BDBM64542
Synonyms:
5-(dimethylcarbamoyloxy)-2-methyl-benzofuran-3-carboxylic acid isopropyl ester MLS000042675 cid_667353 | propan-2-yl 5-(dimethylcarbamoyloxy)-2-methyl-1-benzofuran-3-carboxylate
Type:
Small organic molecule
Emp. Form.:
C16H19NO5
Mol. Mass.:
305.3258
SMILES:
CC(C)OC(=O)c1c(C)oc2ccc(OC(=O)N(C)C)cc12
: