Target
Serine/threonine-protein phosphatase
Ligand
BDBM64545
Substrate
Meas. Tech.
Luminesence Cell-Based Secondary Assay to Identify Inhibitors of Calcineurin
EC50
180000±n/a nM
Citation
 PubChem, PC Luminesence Cell-Based Secondary Assay to Identify Inhibitors of Calcineurin PubChem Bioassay (2010)[AID] 
Target
Name:
Serine/threonine-protein phosphatase
Synonyms:
calcineurin A1, putative serine/threonine-protein phosphatase 2B catalytic subunit A1, putative
Type:
Enzyme Catalytic Domain
Mol. Mass.:
69558.03
Organism:
Candida dubliniensis CD36
Description:
gi_223640082
Residue:
607
  
Inhibitor
Name:
BDBM64545
Synonyms:
3,5-dimethyl-1-phenyl-4-pyrazolecarboxylic acid [3-cyano-3-(1,3-dihydrobenzimidazol-2-ylidene)-2-oxopropyl] ester MLS000053776 [3-cyano-3-(1,3-dihydrobenzimidazol-2-ylidene)-2-oxidanylidene-propyl] 3,5-dimethyl-1-phenyl-pyrazole-4-carboxylate cid_5742508
Type:
Small organic molecule
Emp. Form.:
C23H19N5O3
Mol. Mass.:
413.4287
SMILES:
Cc1nn(c(C)c1C(=O)OCC(=O)C(C#N)c1nc2ccccc2[nH]1)-c1ccccc1
: