Target
Serine/threonine-protein phosphatase
Ligand
BDBM64548
Substrate
Meas. Tech.
Luminesence Cell-Based Secondary Assay to Identify Inhibitors of Calcineurin
EC50
180000±n/a nM
Citation
 PubChem, PC Luminesence Cell-Based Secondary Assay to Identify Inhibitors of Calcineurin PubChem Bioassay (2010)[AID] 
Target
Name:
Serine/threonine-protein phosphatase
Synonyms:
calcineurin A1, putative serine/threonine-protein phosphatase 2B catalytic subunit A1, putative
Type:
Enzyme Catalytic Domain
Mol. Mass.:
69558.03
Organism:
Candida dubliniensis CD36
Description:
gi_223640082
Residue:
607
  
Inhibitor
Name:
BDBM64548
Synonyms:
MLS000087310 N-(3-cyano-4,5,6,7-tetrahydro-1-benzothiophen-2-yl)-5-methyl-1,2-oxazole-3-carboxamide N-(3-cyano-4,5,6,7-tetrahydrobenzothiophen-2-yl)-5-methyl-isoxazole-3-carboxamide cid_3239681
Type:
Small organic molecule
Emp. Form.:
C14H13N3O2S
Mol. Mass.:
287.337
SMILES:
Cc1cc(no1)C(=O)Nc1sc2CCCCc2c1C#N
: