Target
Serine/threonine-protein phosphatase
Ligand
BDBM42715
Substrate
Meas. Tech.
Luminesence Cell-Based Secondary Assay to Identify Inhibitors of Calcineurin
EC50
180000±n/a nM
Citation
 PubChem, PC Luminesence Cell-Based Secondary Assay to Identify Inhibitors of Calcineurin PubChem Bioassay (2010)[AID] 
Target
Name:
Serine/threonine-protein phosphatase
Synonyms:
calcineurin A1, putative serine/threonine-protein phosphatase 2B catalytic subunit A1, putative
Type:
Enzyme Catalytic Domain
Mol. Mass.:
69558.03
Organism:
Candida dubliniensis CD36
Description:
gi_223640082
Residue:
607
  
Inhibitor
Name:
BDBM42715
Synonyms:
3-(4-{[4-(4-fluorophenyl)piperazin-1-yl]carbonyl}benzyl)quinazoline-2,4(1H,3H)-dione 3-[[4-[4-(4-fluorophenyl)piperazin-1-yl]carbonylphenyl]methyl]-1H-quinazoline-2,4-dione 3-[[4-[[4-(4-fluorophenyl)-1-piperazinyl]-oxomethyl]phenyl]methyl]-1H-quinazoline-2,4-dione SMR000030203 | cid_3240330
Type:
Small organic molecule
Emp. Form.:
C26H23FN4O3
Mol. Mass.:
458.4842
SMILES:
Fc1ccc(cc1)N1CCN(CC1)C(=O)c1ccc(Cn2c(=O)[nH]c3ccccc3c2=O)cc1
: